{"text_format":"1","workbook":"xlsx","n_sheets":5,"sheets":["Sheet1","Calculator","UNSP","Sheet4","Sheet3"],"not_rendered":{"charts":0,"images":1,"macros":1,"external_links":0,"defined_names":2,"comments":0,"pivot_tables":0},"unopened":[],"bounds":{"document_bytes":16777216,"sheet_cells":100000,"rows_first":2000,"rows_last":500,"rows_between":2000,"halvings":0,"cell_chars":16384,"cell_head_chars":4096},"cells_cut":0,"cells_raw":0,"read":"whole","date_system":"1900"}

{"sheet":"Sheet1","index":0,"n_rows":238,"n_cols":9,"rows_kept":238,"cut":false,"hidden":true,"merged":[]}
["Country","Currency","One","2-5","6-10","11-50","50-150","151-250","251+"]
["United Kingdom","GBP",124.2,119.03,113.85,98.33,72.45,51.75,10.35]
["Afghanistan","GBP",120.06,114.89,109.71,95.22,70.38,49.68,10.35]
["Albania","EUR",137.66,131.44999999999999,126.27,108.68,80.73,56.93,11.39]
["Algeria","GBP",120.06,114.89,109.71,95.22,70.38,49.68,10.35]
["American Samoa","USD",56.93,54.86,52.79,45.54,33.119999999999997,23.81,5.18]
["Andorra","EUR",137.66,131.44999999999999,126.27,108.68,80.73,56.93,11.39]
["Angola","USD",81.77,78.66,74.52,64.17,47.61,34.159999999999997,7.25]
["Anguilla","USD",90.05,85.91,81.77,71.42,52.79,37.26,7.25]
["Antarctica","USD",56.93,54.86,52.79,45.54,33.119999999999997,23.81,5.18]
["Antigua and Barbuda","USD",65.209999999999994,62.1,60.03,51.75,38.299999999999997,26.91,5.18]
["Argentina","USD",62.1,59,55.89,48.65,35.19,25.88,5.18]
["Armenia","EUR",137.66,131.44999999999999,126.27,108.68,80.73,56.93,11.39]
["Aruba","USD",122.13,116.96,111.78,97.29,71.42,50.72,10.35]
["Australia","AUD",156.29,149.04,142.83000000000001,123.17,91.08,65.209999999999994,13.46]
["Australia Central Territory (Christmas Islands)","USD",56.93,54.86,52.79,45.54,33.119999999999997,23.81,5.18]
["Australia Central Territory (Norfolk  Islands)","USD",56.93,54.86,52.79,45.54,33.119999999999997,23.81,5.18]
["Austria","EUR",137.66,131.44999999999999,126.27,108.68,80.73,56.93,11.39]
["Azerbaijan","EUR",137.66,131.44999999999999,126.27,108.68,80.73,56.93,11.39]
["Bahamas","USD",122.13,116.96,111.78,97.29,71.42,50.72,10.35]
["Bahrain","GBP",120.06,114.89,109.71,95.22,70.38,49.68,10.35]
["Bangladesh","USD",65.209999999999994,62.1,60.03,51.75,38.299999999999997,26.91,5.18]
["Barbados","USD",90.05,85.91,81.77,71.42,52.79,37.26,7.25]
["Belarus","EUR",137.66,131.44999999999999,126.27,108.68,80.73,56.93,11.39]
["Belgium","EUR",137.66,131.44999999999999,126.27,108.68,80.73,56.93,11.39]
["Belize","USD",61.07,59,55.89,48.65,35.19,25.88,5.18]
["Benin","USD",81.77,78.66,74.52,64.17,47.61,34.159999999999997,7.25]
["Bermuda","USD",122.13,116.96,111.78,97.29,71.42,50.72,10.35]
["Bhutan","USD",56.93,54.86,52.79,45.54,33.119999999999997,23.81,5.18]
["Bolivia","USD",61.07,59,55.89,48.65,35.19,25.88,5.18]
["Bosnia And Herzegovina","EUR",137.66,131.44999999999999,126.27,108.68,80.73,56.93,11.39]
["Botswana","USD",81.77,78.66,74.52,64.17,47.61,34.159999999999997,7.25]
["Brazil","BRL",654.12,626.17999999999995,599.27,517.5,380.88,272.20999999999998,54.86]
["British Indian Ocean Territory","USD",56.93,54.86,52.79,45.54,33.119999999999997,23.81,5.18]
["British Virgin Islands","USD",122.13,116.96,111.78,97.29,71.42,50.72,10.35]
["Brunei Darussalam","USD",98.33,94.19,90.05,77.63,56.93,40.369999999999997,8.2799999999999994]
["Bulgaria","EUR",137.66,131.44999999999999,126.27,108.68,80.73,56.93,11.39]
["Burkina Faso","USD",81.77,78.66,74.52,64.17,47.61,34.159999999999997,7.25]
["Burundi","USD",81.77,78.66,74.52,64.17,47.61,34.159999999999997,7.25]
["Cambodia","USD",56.93,54.86,52.79,45.54,33.119999999999997,23.81,5.18]
["Cameroon","USD",81.77,78.66,74.52,64.17,47.61,34.159999999999997,7.25]
["Canada","CAD",213.21,203.9,195.62,168.71,124.2,89.01,17.600000000000001]
["Cape Verde","USD",81.77,78.66,74.52,64.17,47.61,34.159999999999997,7.25]
["Cayman Islands","USD",122.13,116.96,111.78,97.29,71.42,50.72,10.35]
["Central African Republic","USD",81.77,78.66,74.52,64.17,47.61,34.159999999999997,7.25]
["Chad","USD",81.77,78.66,74.52,64.17,47.61,34.159999999999997,7.25]
["Chile","USD",61.07,59,55.89,48.65,35.19,25.88,5.18]
["China","GBP",62.1,60.03,56.93,49.68,36.229999999999997,25.88,5.18]
["Cocos (Keeling) Islands","USD",56.93,54.86,52.79,45.54,33.119999999999997,23.81,5.18]
["Colombia","USD",61.07,59,55.89,48.65,35.19,25.88,5.18]
["Comoros","USD",81.77,78.66,74.52,64.17,47.61,34.159999999999997,7.25]
["Congo, Republic of","USD",81.77,78.66,74.52,64.17,47.61,34.159999999999997,7.25]
["Cook Islands","USD",73.489999999999995,70.38,67.28,57.96,42.44,31.05,6.21]
["Costa Rica","USD",61.07,59,55.89,48.65,35.19,25.88,5.18]
["Cote D'ivoire","USD",81.77,78.66,74.52,64.17,47.61,34.159999999999997,7.25]
["Croatia","EUR",137.66,131.44999999999999,126.27,108.68,80.73,56.93,11.39]
["Cuba","USD",65.209999999999994,62.1,60.03,51.75,38.299999999999997,26.91,5.18]
["Cyprus","EUR",137.66,131.44999999999999,126.27,108.68,80.73,56.93,11.39]
["Czech Republic","EUR",137.66,131.44999999999999,126.27,108.68,80.73,56.93,11.39]
["Democratic People's Republic of Korea","USD",56.93,54.86,52.79,45.54,33.119999999999997,23.81,5.18]
["Denmark","EUR",137.66,131.44999999999999,126.27,108.68,80.73,56.93,11.39]
["Djibouti","USD",81.77,78.66,74.52,64.17,47.61,34.159999999999997,7.25]
["Dominica","USD",65.209999999999994,62.1,60.03,51.75,38.299999999999997,26.91,5.18]
["Dominican Republic","USD",61.07,59,55.89,48.65,35.19,25.88,5.18]
["East Timor","USD",56.93,54.86,52.79,45.54,33.119999999999997,23.81,5.18]
["Ecuador","USD",61.07,59,55.89,48.65,35.19,25.88,5.18]
["Egypt","GBP",120.06,114.89,109.71,95.22,70.38,49.68,10.35]
["El Salvador","USD",61.07,59,55.89,48.65,35.19,25.88,5.18]
["Equatorial Guinea","USD",81.77,78.66,74.52,64.17,47.61,34.159999999999997,7.25]
["Eritrea","USD",81.77,78.66,74.52,64.17,47.61,34.159999999999997,7.25]
["Estonia","EUR",137.66,131.44999999999999,126.27,108.68,80.73,56.93,11.39]
["Ethiopia","USD",81.77,78.66,74.52,64.17,47.61,34.159999999999997,7.25]
["Falkland Islands","USD",90.05,85.91,81.77,71.42,52.79,37.26,7.25]
["Faroe Islands","EUR",137.66,131.44999999999999,126.27,108.68,80.73,56.93,11.39]
["Federated States of Micronesia","USD",73.489999999999995,70.38,67.28,57.96,42.44,31.05,6.21]
["Fiji","AUD",78.66,75.56,72.45,62.1,45.54,33.119999999999997,6.21]
["Finland","EUR",137.66,131.44999999999999,126.27,108.68,80.73,56.93,11.39]
["France","EUR",137.66,131.44999999999999,126.27,108.68,80.73,56.93,11.39]
["French Guiana","USD",61.07,59,55.89,48.65,35.19,25.88,5.18]
["French Polynesia","USD",105.57,101.43,97.29,83.84,62.1,44.51,9.32]
{"$rows_left_out":159}
{"sheet":"Calculator","index":1,"n_rows":18,"n_cols":19,"rows_kept":18,"cut":false,"hidden":false,"merged":[[9,12,9,14],[8,12,8,14],[2,2,2,8],[17,2,18,2],[17,4,18,4],[17,6,18,6],[17,8,18,8],[9,2,10,8],[4,2,4,8],[14,2,14,14]]}
[]
[]
[null,null,"\nFee scale calculator"]
[null,null,"Sponsorship"]
[null,null,"Please select your country of operation from the drop down below based on where your head office is located. Please note that firms in the UK (this includes the Channel Islands) will be charged VAT at the rate of 20%. \n\nThe figures below show how much you would pay for sponsoring members. The cost is reduced as you ascend through each bracket. So if you were in the UK and sponsored 6 members it would be calculated as below. \n                                 1 x 124 GBP + 4 x 119 GBP + 1 x 114 = 714 GBP\n\n\n\n"]
[null,null,"Country (Drop Down)",null,"Currency",null,"One",null,"2-5",null,"6-10",null,"11-50",null,"51-150",null,"151-250",null,"251+"]
[null,null,"United Kingdom",null,{"$f":"IFERROR(VLOOKUP(C7,Sheet1!1:1048576,2,FALSE), \"N/A\")","v":"GBP"},null,{"$f":"IFERROR(VLOOKUP(C7,Sheet1!1:1048576,3,FALSE), \"0\")","v":124.2},null,{"$f":"IFERROR(VLOOKUP(C7,Sheet1!1:1048576,4,FALSE), \"0\")","v":119.03},null,{"$f":"IFERROR(VLOOKUP(C7,Sheet1!1:1048576,5,FALSE), \"0\")","v":113.85},null,{"$f":"IFERROR(VLOOKUP(C7,Sheet1!1:1048576,6,FALSE), \"0\")","v":98.33},null,{"$f":"IFERROR(VLOOKUP(C7,Sheet1!1:1048576,7,FALSE), \"0\")","v":72.45},null,{"$f":"IFERROR(VLOOKUP(C7,Sheet1!1:1048576,8,FALSE), \"0\")","v":51.75},null,{"$f":"IFERROR(VLOOKUP(C7,Sheet1!1:1048576,9,FALSE), \"0\")","v":10.35}]
[]
[null,null,null,null,null,null,null,null,null,null,"Count",null,"Cost"]
[null,null,"Select the number of members you wish to sponsor to calculate the cost in the above currency from the \"count\" drop to the right. You must select a country to return a figure.",null,null,null,null,null,null,null,6,null,{"$f":"IFERROR(VLOOKUP(K10,Sheet4!1:1048576,2,FALSE), \"0\")","v":714.17}]
[]
[]
[null,null,"Unsponsored Members"]
[]
[null,null,"For the cost of applying for or renewing your licence for Valuer Registration, select your country of operation from the drop down below. Please note members in the UK (this includes the Channel Islands) will be charged VAT at a rate of 20%"]
[]
[null,null,"Country (Drop Down)",null,"Currency",null,"Fee",null,"Renew"]
[null,null,"Afghanistan",null,{"$f":"IFERROR(VLOOKUP(C18,UNSP!A1:F238,2,FALSE), \"N/A\")","v":"GBP"},null,{"$f":"IFERROR(VLOOKUP(C18,UNSP!A1:F238,4,FALSE), \"0\")","v":139.72999999999999},null,{"$f":"IFERROR(VLOOKUP(C18,UNSP!A1:F238,6,FALSE), \"0\")","v":139.72999999999999}]

{"sheet":"UNSP","index":2,"n_rows":238,"n_cols":6,"rows_kept":238,"cut":false,"hidden":true,"merged":[]}
["Country","Currency","Regulated Area","ApplicationFee","RegistrationFee","RenewalFee"]
["Afghanistan","GBP","Europe, Middle East & Africa (EMEA)",139.72999999999999,0,139.72999999999999]
["Albania","EUR","Europe, Middle East & Africa (EMEA)",160.43,0,155]
["Algeria","GBP","Europe, Middle East & Africa (EMEA)",139.72999999999999,0,135]
["American Samoa","USD","Asia Pacific",66.239999999999995,0,64]
["Andorra","EUR","Europe, Middle East & Africa (EMEA)",160.43,0,155]
["Angola","USD","Europe, Middle East & Africa (EMEA)",87.98,0,92]
["Anguilla","USD","Americas",137.66,0,100]
["Antarctica","USD","Asia Pacific",66.239999999999995,0,64]
["Antigua And Barbuda","USD","Americas",76.59,0,74]
["Argentina","USD","Americas",72.45,0,69]
["Armenia","EUR","Europe, Middle East & Africa (EMEA)",160.43,0,155]
["Aruba","USD","Americas",144.9,0,138]
["Australia","AUD","Asia Pacific",182.16,0,176]
["Austria","EUR","Europe, Middle East & Africa (EMEA)",160.43,0,155]
["Azerbaijan","EUR","Europe, Middle East & Africa (EMEA)",160.43,0,155]
["Bahamas","USD","Americas",142.83000000000001,0,138]
["Bahrain","GBP","Europe, Middle East & Africa (EMEA)",139.72999999999999,0,135]
["Bangladesh","USD","Asia Pacific",76.59,0,74]
["Barbados","USD","Americas",110.75,0,100]
["Belarus","EUR","Europe, Middle East & Africa (EMEA)",160.43,0,155]
["Belgium","EUR","Europe, Middle East & Africa (EMEA)",160.43,0,155]
["Belize","USD","Americas",71.42,0,69]
["Benin","USD","Europe, Middle East & Africa (EMEA)",95.22,0,92]
["Bermuda","USD","Americas",142.83000000000001,0,138]
["Bhutan","USD","Asia Pacific",66.239999999999995,0,64]
["Bolivia","USD","Americas",71.42,0,69]
["Bosnia And Herzegovina","EUR","Europe, Middle East & Africa (EMEA)",160.43,0,155]
["Botswana","USD","Europe, Middle East & Africa (EMEA)",95.22,0,92]
["Brazil","BRL","Americas",762.8,0,737]
["British Indian Ocean Territory","USD","Asia Pacific",66.239999999999995,0,64]
["British Virgin Islands","USD","Americas",142.83000000000001,0,138]
["Brunei Darussalam","USD","Asia Pacific",113.85,0,110]
["Bulgaria","EUR","Europe, Middle East & Africa (EMEA)",160.43,0,155]
["Burkina Faso","USD","Europe, Middle East & Africa (EMEA)",95.22,0,92]
["Burundi","USD","Europe, Middle East & Africa (EMEA)",95.22,0,92]
["Cambodia","USD","Asia Pacific",66.239999999999995,0,64]
["Cameroon","USD","Europe, Middle East & Africa (EMEA)",95.22,0,92]
["Canada","CAD","Americas",248.4,0,240]
["Cape Verde","USD","Europe, Middle East & Africa (EMEA)",95.22,0,92]
["Cayman Islands","USD","Americas",142.83000000000001,0,138]
["Central African Republic","USD","Europe, Middle East & Africa (EMEA)",95.22,0,92]
["Chad","USD","Europe, Middle East & Africa (EMEA)",95.22,0,92]
["Chile","USD","Americas",71.42,0,69]
["China","GBP","Asia Pacific",72.45,0,70]
["Christmas Island","USD","Asia Pacific",66.239999999999995,0,64]
["Cocos (Keeling) Islands","USD","Asia Pacific",66.239999999999995,0,64]
["Colombia","USD","Americas",71.42,0,69]
["Comoros","USD","Europe, Middle East & Africa (EMEA)",95.22,0,92]
["Congo, Republic of","USD","Europe, Middle East & Africa (EMEA)",95.22,0,92]
["Cook Islands","USD","Asia Pacific",85.91,0,83]
["Costa Rica","USD","Americas",71.42,0,69]
["Cote D'ivoire","USD","Europe, Middle East & Africa (EMEA)",95.22,0,92]
["Croatia","EUR","Europe, Middle East & Africa (EMEA)",160.43,0,155]
["Cuba","USD","Americas",76.59,0,74]
["Cyprus","EUR","Europe, Middle East & Africa (EMEA)",160.43,0,155]
["Czech Republic","EUR","Europe, Middle East & Africa (EMEA)",160.43,0,155]
["Democratic People's Republic of Korea","USD","Asia Pacific",66.239999999999995,0,64]
["Denmark","EUR","Europe, Middle East & Africa (EMEA)",160.43,0,155]
["Djibouti","USD","Europe, Middle East & Africa (EMEA)",95.22,0,92]
["Dominica","USD","Americas",76.59,0,74]
["Dominican Republic","USD","Americas",71.42,0,69]
["Ecuador","USD","Americas",71.42,0,69]
["Egypt","GBP","Europe, Middle East & Africa (EMEA)",139.72999999999999,0,135]
["El Salvador","USD","Americas",71.42,0,69]
["Equatorial Guinea","USD","Europe, Middle East & Africa (EMEA)",95.22,0,92]
["Eritrea","USD","Europe, Middle East & Africa (EMEA)",95.22,0,92]
["Estonia","EUR","Europe, Middle East & Africa (EMEA)",160.43,0,155]
["Ethiopia","USD","Europe, Middle East & Africa (EMEA)",95.22,0,92]
["Falkland Islands","USD","Americas",104.54,0,100]
["Faroe Islands","EUR","Europe, Middle East & Africa (EMEA)",160.43,0,155]
["Federated States of Micronesia","USD","Asia Pacific",85.91,0,83]
["Fiji","AUD","Asia Pacific",92.12,0,89]
["Finland","EUR","Europe, Middle East & Africa (EMEA)",160.43,0,155]
["France","EUR","Europe, Middle East & Africa (EMEA)",160.43,0,155]
["French Guiana","USD","Americas",71.42,0,69]
["French Polynesia","USD","Asia Pacific",123.17,0,119]
["French Southern Territories","USD","Asia Pacific",66.239999999999995,0,64]
["Gabon","USD","Europe, Middle East & Africa (EMEA)",95.22,0,92]
["Gambia","USD","Europe, Middle East & Africa (EMEA)",95.22,0,92]
{"$rows_left_out":159}
{"sheet":"Sheet4","index":3,"n_rows":1003,"n_cols":4,"rows_kept":1003,"cut":false,"hidden":true,"merged":[]}
[]
[]
[]
[1,{"$f":"Calculator!G7","v":124.2}]
[2,{"$f":"Calculator!G7+Calculator!I7","v":243.23000000000002}]
[3,{"$f":"Calculator!G7+Calculator!I7+Calculator!I7","v":362.26}]
[4,{"$f":"Calculator!G7+Calculator!I7+Calculator!I7+Calculator!I7","v":481.28999999999996}]
[5,{"$f":"Calculator!G7+Calculator!I7+Calculator!I7+Calculator!I7+Calculator!I7","v":600.31999999999994}]
[6,{"$f":"Calculator!G7+Calculator!I7+Calculator!I7+Calculator!I7+Calculator!I7+Calculator!K7","v":714.17}]
[7,{"$f":"Calculator!G7+Calculator!I7+Calculator!I7+Calculator!I7+Calculator!I7+Calculator!K7+Calculator!K7","v":828.02}]
[8,{"$f":"Calculator!G7+Calculator!I7+Calculator!I7+Calculator!I7+Calculator!I7+Calculator!K7+Calculator!K7+Calculator!K7","v":941.87}]
[9,{"$f":"Calculator!G7+Calculator!I7+Calculator!I7+Calculator!I7+Calculator!I7+Calculator!K7+Calculator!K7+Calculator!K7+Calculator!K7","v":1055.72}]
[10,{"$f":"Calculator!G7+Calculator!I7+Calculator!I7+Calculator!I7+Calculator!I7+Calculator!K7+Calculator!K7+Calculator!K7+Calculator!K7+Calculator!K7","v":1169.57}]
[11,{"$f":"$B$13+C14","v":1267.8999999999999},{"$f":"1*Calculator!M7","v":98.33}]
[12,{"$f":"$B$13+C15","v":1366.23},{"$f":"2*Calculator!M7","v":196.66}]
[13,1464.56,{"$f":"3*Calculator!M7","v":294.99}]
[14,1562.8899999999999,{"$f":"4*Calculator!M7","v":393.32}]
[15,1661.2199999999998,{"$f":"5*Calculator!M7","v":491.65}]
[16,1759.55,{"$f":"6*Calculator!M7","v":589.98}]
[17,1857.8799999999999,{"$f":"7*Calculator!M7","v":688.31}]
[18,1956.21,{"$f":"8*Calculator!M7","v":786.64}]
[19,2054.54,{"$f":"9*Calculator!M7","v":884.97}]
[20,2152.87,{"$f":"10*Calculator!M7","v":983.3}]
[21,2251.1999999999998,{"$f":"11*Calculator!M7","v":1081.6299999999999}]
[22,2349.5299999999997,{"$f":"12*Calculator!M7","v":1179.96}]
[23,2447.8599999999997,{"$f":"13*Calculator!M7","v":1278.29}]
[24,2546.1899999999996,{"$f":"14*Calculator!M7","v":1376.62}]
[25,2644.52,{"$f":"15*Calculator!M7","v":1474.95}]
[26,2742.85,{"$f":"16*Calculator!M7","v":1573.28}]
[27,2841.18,{"$f":"17*Calculator!M7","v":1671.61}]
[28,2939.51,{"$f":"18*Calculator!M7","v":1769.94}]
[29,3037.84,{"$f":"19*Calculator!M7","v":1868.27}]
[30,3136.17,{"$f":"20*Calculator!M7","v":1966.6}]
[31,3234.5,{"$f":"21*Calculator!M7","v":2064.9299999999998}]
[32,3332.83,{"$f":"22*Calculator!M7","v":2163.2599999999998}]
[33,3431.16,{"$f":"23*Calculator!M7","v":2261.59}]
[34,3529.49,{"$f":"24*Calculator!M7","v":2359.92}]
[35,3627.8199999999997,{"$f":"25*Calculator!M7","v":2458.25}]
[36,3726.1499999999996,{"$f":"26*Calculator!M7","v":2556.58}]
[37,3824.4799999999996,{"$f":"27*Calculator!M7","v":2654.91}]
[38,3922.8099999999995,{"$f":"28*Calculator!M7","v":2753.24}]
[39,4021.1400000000003,{"$f":"29*Calculator!M7","v":2851.57}]
[40,4119.47,{"$f":"30*Calculator!M7","v":2949.9}]
[41,4217.8,{"$f":"31*Calculator!M7","v":3048.23}]
[42,4316.13,{"$f":"32*Calculator!M7","v":3146.56}]
[43,4414.46,{"$f":"33*Calculator!M7","v":3244.89}]
[44,4512.79,{"$f":"34*Calculator!M7","v":3343.22}]
[45,4611.12,{"$f":"35*Calculator!M7","v":3441.5499999999997}]
[46,4709.45,{"$f":"36*Calculator!M7","v":3539.88}]
[47,4807.78,{"$f":"37*Calculator!M7","v":3638.21}]
[48,4906.1099999999997,{"$f":"38*Calculator!M7","v":3736.54}]
[49,5004.4399999999996,{"$f":"39*Calculator!M7","v":3834.87}]
[50,5102.7699999999995,{"$f":"40*Calculator!M7","v":3933.2}]
[51,{"$f":"$B$53+C54","v":5175.2199999999993},{"$f":"Calculator!O7","v":72.45}]
[52,5247.6699999999992,{"$f":"2*Calculator!O7","v":144.9}]
[53,5320.12,{"$f":"3*Calculator!O7","v":217.35000000000002}]
[54,5392.57,{"$f":"4*Calculator!O7","v":289.8}]
[55,5465.0199999999995,{"$f":"5*Calculator!O7","v":362.25}]
[56,5537.4699999999993,{"$f":"6*Calculator!O7","v":434.70000000000005}]
[57,5609.9199999999992,{"$f":"7*Calculator!O7","v":507.15000000000003}]
[58,{"$f":"$B$53+C61","v":5682.37},{"$f":"8*Calculator!O7","v":579.6}]
[59,{"$f":"$B$53+C62","v":5754.82},{"$f":"Calculator!O7*Sheet4!D62","v":652.05000000000007},9]
[60,{"$f":"$B$53+C63","v":5827.2699999999995},{"$f":"Calculator!O7*Sheet4!D63","v":724.5},10]
[61,5899.7199999999993,{"$f":"Calculator!$O$7*Sheet4!D64","v":796.95},11]
[62,5972.17,{"$f":"Calculator!$O$7*Sheet4!D65","v":869.40000000000009},12]
[63,6044.62,{"$f":"Calculator!$O$7*Sheet4!D66","v":941.85},13]
[64,6117.07,{"$f":"Calculator!$O$7*Sheet4!D67","v":1014.3000000000001},14]
[65,6189.5199999999995,{"$f":"Calculator!$O$7*Sheet4!D68","v":1086.75},15]
[66,6261.9699999999993,{"$f":"Calculator!$O$7*Sheet4!D69","v":1159.2},16]
[67,6334.42,{"$f":"Calculator!$O$7*Sheet4!D70","v":1231.6500000000001},17]
[68,6406.87,{"$f":"Calculator!$O$7*Sheet4!D71","v":1304.1000000000001},18]
[69,6479.32,{"$f":"Calculator!$O$7*Sheet4!D72","v":1376.55},19]
[70,6551.7699999999995,{"$f":"Calculator!$O$7*Sheet4!D73","v":1449},20]
[71,6624.2199999999993,{"$f":"Calculator!$O$7*Sheet4!D74","v":1521.45},21]
[72,6696.67,{"$f":"Calculator!$O$7*Sheet4!D75","v":1593.9},22]
[73,6769.12,{"$f":"Calculator!$O$7*Sheet4!D76","v":1666.3500000000001},23]
[74,6841.57,{"$f":"Calculator!$O$7*Sheet4!D77","v":1738.8000000000002},24]
[75,6914.0199999999995,{"$f":"Calculator!$O$7*Sheet4!D78","v":1811.25},25]
[76,6986.4699999999993,{"$f":"Calculator!$O$7*Sheet4!D79","v":1883.7},26]
[77,7058.92,{"$f":"Calculator!$O$7*Sheet4!D80","v":1956.15},27]
{"$rows_left_out":924}
{"sheet":"Sheet3","index":4,"n_rows":0,"n_cols":0,"rows_kept":0,"cut":false,"hidden":true,"merged":[]}